{"text_format":"1","workbook":"xlsx","n_sheets":3,"sheets":["!","@","Options"],"not_rendered":{"charts":0,"images":2,"macros":1,"external_links":0,"defined_names":63,"comments":0,"pivot_tables":0},"unopened":[],"bounds":{"document_bytes":16777216,"sheet_cells":100000,"rows_first":2000,"rows_last":500,"rows_between":2000,"halvings":0,"cell_chars":16384,"cell_head_chars":4096},"cells_cut":0,"cells_raw":0,"read":"whole","date_system":"1900"}

{"sheet":"!","index":0,"n_rows":32,"n_cols":3,"rows_kept":32,"cut":false,"hidden":false,"merged":[[36,3,36,5],[36,7,36,9],[36,11,36,13],[31,2,34,14]]}
[]
[]
[]
[]
[]
[]
[]
[]
{"$rows_left_out":25}
{"sheet":"@","index":1,"n_rows":44,"n_cols":18,"rows_kept":44,"cut":false,"hidden":false,"merged":[[16,1,16,3],[17,1,18,3],[15,14,15,17],[15,9,15,12],[19,1,20,3],[15,1,15,7]]}
[]
[]
[]
[]
[]
[]
[]
[]
{"$rows_left_out":37}
{"sheet":"Options","index":2,"n_rows":48,"n_cols":65,"rows_kept":48,"cut":false,"hidden":true,"merged":[[5,5,5,6],[6,5,6,6],[7,5,7,6],[8,5,8,6],[9,5,9,6],[1,1,1,3],[1,5,1,10],[2,5,2,6],[3,5,3,6],[4,5,4,6]]}
[]
[null,"Параметры",null,null,null,"Показатели рабочей группы",null,null,null,null,null,null,"№","Status","Em","B","I","EmBI","Em0","B0","I0","EmBI0","Em-","B-","I-","EmBI-"]
[null,"Кол.вопросов",{"$f":"COUNT(dbTest[№])","v":21},null,null,"EmBI-показатели",null,"Em","B","I","EmBI",null,{"$f":"IF(ISNUMBER('@'!B25),IF(INDEX(TESTED,1,'@'!B25)=QUESTIONS_COUNT,'@'!B25,\"\"),\"\")","v":""},{"$f":"IF(ISNUMBER(EmBI_Indexes[[#This Row],[№]]),'@'!D25,\"\")","v":""},{"$f":"IFERROR(IF(ISNUMBER(EmBI_Indexes[[#This Row],[№]]),INT((COUNTIF(Em_1,EmBI_Indexes[[#This Row],[№]])*W_1+COUNTIF(Em_2,EmBI_Indexes[[#This Row],[№]])*W_2+COUNTIF(Em_3,EmBI_Indexes[[#This Row],[№]]))/Em_Wmax*100+0.5),\"\"),\"\")","v":""},{"$f":"IFERROR(IF(ISNUMBER(EmBI_Indexes[[#This Row],[№]]),INT((COUNTIF(B_1,EmBI_Indexes[[#This Row],[№]])*W_1+COUNTIF(B_2,EmBI_Indexes[[#This Row],[№]])*W_2+COUNTIF(B_3,EmBI_Indexes[[#This Row],[№]]))/B_Wmax*100+0.5),\"\"),\"\")","v":""},{"$f":"IFERROR(IF(ISNUMBER(EmBI_Indexes[[#This Row],[№]]),INT((COUNTIF(I_1,EmBI_Indexes[[#This Row],[№]])*W_1+COUNTIF(I_2,EmBI_Indexes[[#This Row],[№]])*W_2+COUNTIF(I_3,EmBI_Indexes[[#This Row],[№]]))/I_Wmax*100+0.5),\"\"),\"\")","v":""},{"$f":"IFERROR(IF(ISNUMBER(EmBI_Indexes[[#This Row],[№]]),INT((COUNTIF(EmBI_1,EmBI_Indexes[[#This Row],[№]])*W_1+COUNTIF(EmBI_2,EmBI_Indexes[[#This Row],[№]])*W_2+COUNTIF(EmBI_3,EmBI_Indexes[[#This Row],[№]]))/EmBI_Wmax*100+0.5),\"\"),\"\")","v":""},{"$f":"IFERROR(IF(ISNUMBER(EmBI_Indexes[[#This Row],[№]]),INT((COUNTIF(INDEX(Em_1,,EmBI_Indexes[[#This Row],[№]]),0)+COUNTIF(INDEX(Em_2,,EmBI_Indexes[[#This Row],[№]]),0)+COUNTIF(INDEX(Em_3,,EmBI_Indexes[[#This Row],[№]]),0))/Em_Anwers*100+0.5),\"\"),\"\")","v":""},{"$f":"IFERROR(IF(ISNUMBER(EmBI_Indexes[[#This Row],[№]]),INT((COUNTIF(INDEX(B_1,,EmBI_Indexes[[#This Row],[№]]),0)+COUNTIF(INDEX(B_2,,EmBI_Indexes[[#This Row],[№]]),0)+COUNTIF(INDEX(B_3,,EmBI_Indexes[[#This Row],[№]]),0))/B_Anwers*100+0.5),\"\"),\"\")","v":""},{"$f":"IFERROR(IF(ISNUMBER(EmBI_Indexes[[#This Row],[№]]),INT((COUNTIF(INDEX(I_1,,EmBI_Indexes[[#This Row],[№]]),0)+COUNTIF(INDEX(I_2,,EmBI_Indexes[[#This Row],[№]]),0)+COUNTIF(INDEX(I_3,,EmBI_Indexes[[#This Row],[№]]),0))/I_Anwers*100+0.5),\"\"),\"\")","v":""},{"$f":"IFERROR(IF(ISNUMBER(EmBI_Indexes[[#This Row],[№]]),INT((COUNTIF(INDEX(EmBI_1,,EmBI_Indexes[[#This Row],[№]]),0)+COUNTIF(INDEX(EmBI_2,,EmBI_Indexes[[#This Row],[№]]),0)+COUNTIF(INDEX(EmBI_3,,EmBI_Indexes[[#This Row],[№]]),0))/EmBI_Answers*100+0.5),\"\"),\"\")","v":""},{"$f":"IFERROR(IF(ISNUMBER(EmBI_Indexes[[#This Row],[№]]),INT((COUNTIF(INDEX(Em_1,,EmBI_Indexes[[#This Row],[№]]),-EmBI_Indexes[[#This Row],[№]])+COUNTIF(INDEX(Em_2,,EmBI_Indexes[[#This Row],[№]]),-EmBI_Indexes[[#This Row],[№]])+COUNTIF(INDEX(Em_3,,EmBI_Indexes[[#This Row],[№]]),-EmBI_Indexes[[#This Row],[№]]))/Em_Anwers*100+0.5),\"\"),\"\")","v":""},{"$f":"IFERROR(IF(ISNUMBER(EmBI_Indexes[[#This Row],[№]]),INT((COUNTIF(INDEX(B_1,,EmBI_Indexes[[#This Row],[№]]),-EmBI_Indexes[[#This Row],[№]])+COUNTIF(INDEX(B_2,,EmBI_Indexes[[#This Row],[№]]),-EmBI_Indexes[[#This Row],[№]])+COUNTIF(INDEX(B_3,,EmBI_Indexes[[#This Row],[№]]),-EmBI_Indexes[[#This Row],[№]]))/B_Anwers*100+0.5),\"\"),\"\")","v":""},{"$f":"IFERROR(IF(ISNUMBER(EmBI_Indexes[[#This Row],[№]]),INT((COUNTIF(INDEX(I_1,,EmBI_Indexes[[#This Row],[№]]),-EmBI_Indexes[[#This Row],[№]])+COUNTIF(INDEX(I_2,,EmBI_Indexes[[#This Row],[№]]),-EmBI_Indexes[[#This Row],[№]])+COUNTIF(INDEX(I_3,,EmBI_Indexes[[#This Row],[№]]),-EmBI_Indexes[[#This Row],[№]]))/I_Anwers*100+0.5),\"\"),\"\")","v":""},{"$f":"IFERROR(IF(ISNUMBER(EmBI_Indexes[[#This Row],[№]]),INT((COUNTIF(INDEX(EmBI_1,,EmBI_Indexes[[#This Row],[№]]),-EmBI_Indexes[[#This Row],[№]])+COUNTIF(INDEX(EmBI_2,,EmBI_Indexes[[#This Row],[№]]),-EmBI_Indexes[[#This Row],[№]])+COUNTIF(INDEX(Em_3,,EmBI_Indexes[[#This Row],[№]]),-EmBI_Indexes[[#This Row],[№]]))/EmBI_Answers*100+0.5),\"\"),\"\")","v":""}]
[null,"№ вопроса",null,{"$f":"IFERROR(INDEX(dbTest[Вопросы],ROW_NUM,1),\"\")","v":""},null,"Кол. вопросов",null,{"$f":"COUNTIF(dbTest[EmBI],1)","v":6},{"$f":"COUNTIF(dbTest[EmBI],2)","v":7},{"$f":"COUNTIF(dbTest[EmBI],3)","v":7},null,null,{"$f":"IF(ISNUMBER('@'!B26),IF(INDEX(TESTED,1,'@'!B26)=QUESTIONS_COUNT,'@'!B26,\"\"),\"\")","v":""},{"$f":"IF(ISNUMBER(EmBI_Indexes[[#This Row],[№]]),'@'!D26,\"\")","v":""},{"$f":"IFERROR(IF(ISNUMBER(EmBI_Indexes[[#This Row],[№]]),INT((COUNTIF(Em_1,EmBI_Indexes[[#This Row],[№]])*W_1+COUNTIF(Em_2,EmBI_Indexes[[#This Row],[№]])*W_2+COUNTIF(Em_3,EmBI_Indexes[[#This Row],[№]]))/Em_Wmax*100+0.5),\"\"),\"\")","v":""},{"$f":"IFERROR(IF(ISNUMBER(EmBI_Indexes[[#This Row],[№]]),INT((COUNTIF(B_1,EmBI_Indexes[[#This Row],[№]])*W_1+COUNTIF(B_2,EmBI_Indexes[[#This Row],[№]])*W_2+COUNTIF(B_3,EmBI_Indexes[[#This Row],[№]]))/B_Wmax*100+0.5),\"\"),\"\")","v":""},{"$f":"IFERROR(IF(ISNUMBER(EmBI_Indexes[[#This Row],[№]]),INT((COUNTIF(I_1,EmBI_Indexes[[#This Row],[№]])*W_1+COUNTIF(I_2,EmBI_Indexes[[#This Row],[№]])*W_2+COUNTIF(I_3,EmBI_Indexes[[#This Row],[№]]))/I_Wmax*100+0.5),\"\"),\"\")","v":""},{"$f":"IFERROR(IF(ISNUMBER(EmBI_Indexes[[#This Row],[№]]),INT((COUNTIF(EmBI_1,EmBI_Indexes[[#This Row],[№]])*W_1+COUNTIF(EmBI_2,EmBI_Indexes[[#This Row],[№]])*W_2+COUNTIF(EmBI_3,EmBI_Indexes[[#This Row],[№]]))/EmBI_Wmax*100+0.5),\"\"),\"\")","v":""},{"$f":"IFERROR(IF(ISNUMBER(EmBI_Indexes[[#This Row],[№]]),INT((COUNTIF(INDEX(Em_1,,EmBI_Indexes[[#This Row],[№]]),0)+COUNTIF(INDEX(Em_2,,EmBI_Indexes[[#This Row],[№]]),0)+COUNTIF(INDEX(Em_3,,EmBI_Indexes[[#This Row],[№]]),0))/Em_Anwers*100+0.5),\"\"),\"\")","v":""},{"$f":"IFERROR(IF(ISNUMBER(EmBI_Indexes[[#This Row],[№]]),INT((COUNTIF(INDEX(B_1,,EmBI_Indexes[[#This Row],[№]]),0)+COUNTIF(INDEX(B_2,,EmBI_Indexes[[#This Row],[№]]),0)+COUNTIF(INDEX(B_3,,EmBI_Indexes[[#This Row],[№]]),0))/B_Anwers*100+0.5),\"\"),\"\")","v":""},{"$f":"IFERROR(IF(ISNUMBER(EmBI_Indexes[[#This Row],[№]]),INT((COUNTIF(INDEX(I_1,,EmBI_Indexes[[#This Row],[№]]),0)+COUNTIF(INDEX(I_2,,EmBI_Indexes[[#This Row],[№]]),0)+COUNTIF(INDEX(I_3,,EmBI_Indexes[[#This Row],[№]]),0))/I_Anwers*100+0.5),\"\"),\"\")","v":""},{"$f":"IFERROR(IF(ISNUMBER(EmBI_Indexes[[#This Row],[№]]),INT((COUNTIF(INDEX(EmBI_1,,EmBI_Indexes[[#This Row],[№]]),0)+COUNTIF(INDEX(EmBI_2,,EmBI_Indexes[[#This Row],[№]]),0)+COUNTIF(INDEX(EmBI_3,,EmBI_Indexes[[#This Row],[№]]),0))/EmBI_Answers*100+0.5),\"\"),\"\")","v":""},{"$f":"IFERROR(IF(ISNUMBER(EmBI_Indexes[[#This Row],[№]]),INT((COUNTIF(INDEX(Em_1,,EmBI_Indexes[[#This Row],[№]]),-EmBI_Indexes[[#This Row],[№]])+COUNTIF(INDEX(Em_2,,EmBI_Indexes[[#This Row],[№]]),-EmBI_Indexes[[#This Row],[№]])+COUNTIF(INDEX(Em_3,,EmBI_Indexes[[#This Row],[№]]),-EmBI_Indexes[[#This Row],[№]]))/Em_Anwers*100+0.5),\"\"),\"\")","v":""},{"$f":"IFERROR(IF(ISNUMBER(EmBI_Indexes[[#This Row],[№]]),INT((COUNTIF(INDEX(B_1,,EmBI_Indexes[[#This Row],[№]]),-EmBI_Indexes[[#This Row],[№]])+COUNTIF(INDEX(B_2,,EmBI_Indexes[[#This Row],[№]]),-EmBI_Indexes[[#This Row],[№]])+COUNTIF(INDEX(B_3,,EmBI_Indexes[[#This Row],[№]]),-EmBI_Indexes[[#This Row],[№]]))/B_Anwers*100+0.5),\"\"),\"\")","v":""},{"$f":"IFERROR(IF(ISNUMBER(EmBI_Indexes[[#This Row],[№]]),INT((COUNTIF(INDEX(I_1,,EmBI_Indexes[[#This Row],[№]]),-EmBI_Indexes[[#This Row],[№]])+COUNTIF(INDEX(I_2,,EmBI_Indexes[[#This Row],[№]]),-EmBI_Indexes[[#This Row],[№]])+COUNTIF(INDEX(I_3,,EmBI_Indexes[[#This Row],[№]]),-EmBI_Indexes[[#This Row],[№]]))/I_Anwers*100+0.5),\"\"),\"\")","v":""},{"$f":"IFERROR(IF(ISNUMBER(EmBI_Indexes[[#This Row],[№]]),INT((COUNTIF(INDEX(EmBI_1,,EmBI_Indexes[[#This Row],[№]]),-EmBI_Indexes[[#This Row],[№]])+COUNTIF(INDEX(EmBI_2,,EmBI_Indexes[[#This Row],[№]]),-EmBI_Indexes[[#This Row],[№]])+COUNTIF(INDEX(Em_3,,EmBI_Indexes[[#This Row],[№]]),-EmBI_Indexes[[#This Row],[№]]))/EmBI_Answers*100+0.5),\"\"),\"\")","v":""}]
[null,"№ строки",{"$f":"IFERROR(MATCH(QUESTION_NUM,dbTest[№ вопроса],0),0)","v":0},{"$f":"IFERROR(MATCH(ANSWER_NAME1,STAFF_LIST,0),0)","v":0},null,"Макс. кол. ответов",null,{"$f":"H4*3","v":18},{"$f":"I4*3","v":21},21,{"$f":"SUM(H5:J5)","v":60},null,{"$f":"IF(ISNUMBER('@'!B27),IF(INDEX(TESTED,1,'@'!B27)=QUESTIONS_COUNT,'@'!B27,\"\"),\"\")","v":""},{"$f":"IF(ISNUMBER(EmBI_Indexes[[#This Row],[№]]),'@'!D27,\"\")","v":""},{"$f":"IFERROR(IF(ISNUMBER(EmBI_Indexes[[#This Row],[№]]),INT((COUNTIF(Em_1,EmBI_Indexes[[#This Row],[№]])*W_1+COUNTIF(Em_2,EmBI_Indexes[[#This Row],[№]])*W_2+COUNTIF(Em_3,EmBI_Indexes[[#This Row],[№]]))/Em_Wmax*100+0.5),\"\"),\"\")","v":""},{"$f":"IFERROR(IF(ISNUMBER(EmBI_Indexes[[#This Row],[№]]),INT((COUNTIF(B_1,EmBI_Indexes[[#This Row],[№]])*W_1+COUNTIF(B_2,EmBI_Indexes[[#This Row],[№]])*W_2+COUNTIF(B_3,EmBI_Indexes[[#This Row],[№]]))/B_Wmax*100+0.5),\"\"),\"\")","v":""},{"$f":"IFERROR(IF(ISNUMBER(EmBI_Indexes[[#This Row],[№]]),INT((COUNTIF(I_1,EmBI_Indexes[[#This Row],[№]])*W_1+COUNTIF(I_2,EmBI_Indexes[[#This Row],[№]])*W_2+COUNTIF(I_3,EmBI_Indexes[[#This Row],[№]]))/I_Wmax*100+0.5),\"\"),\"\")","v":""},{"$f":"IFERROR(IF(ISNUMBER(EmBI_Indexes[[#This Row],[№]]),INT((COUNTIF(EmBI_1,EmBI_Indexes[[#This Row],[№]])*W_1+COUNTIF(EmBI_2,EmBI_Indexes[[#This Row],[№]])*W_2+COUNTIF(EmBI_3,EmBI_Indexes[[#This Row],[№]]))/EmBI_Wmax*100+0.5),\"\"),\"\")","v":""},{"$f":"IFERROR(IF(ISNUMBER(EmBI_Indexes[[#This Row],[№]]),INT((COUNTIF(INDEX(Em_1,,EmBI_Indexes[[#This Row],[№]]),0)+COUNTIF(INDEX(Em_2,,EmBI_Indexes[[#This Row],[№]]),0)+COUNTIF(INDEX(Em_3,,EmBI_Indexes[[#This Row],[№]]),0))/Em_Anwers*100+0.5),\"\"),\"\")","v":""},{"$f":"IFERROR(IF(ISNUMBER(EmBI_Indexes[[#This Row],[№]]),INT((COUNTIF(INDEX(B_1,,EmBI_Indexes[[#This Row],[№]]),0)+COUNTIF(INDEX(B_2,,EmBI_Indexes[[#This Row],[№]]),0)+COUNTIF(INDEX(B_3,,EmBI_Indexes[[#This Row],[№]]),0))/B_Anwers*100+0.5),\"\"),\"\")","v":""},{"$f":"IFERROR(IF(ISNUMBER(EmBI_Indexes[[#This Row],[№]]),INT((COUNTIF(INDEX(I_1,,EmBI_Indexes[[#This Row],[№]]),0)+COUNTIF(INDEX(I_2,,EmBI_Indexes[[#This Row],[№]]),0)+COUNTIF(INDEX(I_3,,EmBI_Indexes[[#This Row],[№]]),0))/I_Anwers*100+0.5),\"\"),\"\")","v":""},{"$f":"IFERROR(IF(ISNUMBER(EmBI_Indexes[[#This Row],[№]]),INT((COUNTIF(INDEX(EmBI_1,,EmBI_Indexes[[#This Row],[№]]),0)+COUNTIF(INDEX(EmBI_2,,EmBI_Indexes[[#This Row],[№]]),0)+COUNTIF(INDEX(EmBI_3,,EmBI_Indexes[[#This Row],[№]]),0))/EmBI_Answers*100+0.5),\"\"),\"\")","v":""},{"$f":"IFERROR(IF(ISNUMBER(EmBI_Indexes[[#This Row],[№]]),INT((COUNTIF(INDEX(Em_1,,EmBI_Indexes[[#This Row],[№]]),-EmBI_Indexes[[#This Row],[№]])+COUNTIF(INDEX(Em_2,,EmBI_Indexes[[#This Row],[№]]),-EmBI_Indexes[[#This Row],[№]])+COUNTIF(INDEX(Em_3,,EmBI_Indexes[[#This Row],[№]]),-EmBI_Indexes[[#This Row],[№]]))/Em_Anwers*100+0.5),\"\"),\"\")","v":""},{"$f":"IFERROR(IF(ISNUMBER(EmBI_Indexes[[#This Row],[№]]),INT((COUNTIF(INDEX(B_1,,EmBI_Indexes[[#This Row],[№]]),-EmBI_Indexes[[#This Row],[№]])+COUNTIF(INDEX(B_2,,EmBI_Indexes[[#This Row],[№]]),-EmBI_Indexes[[#This Row],[№]])+COUNTIF(INDEX(B_3,,EmBI_Indexes[[#This Row],[№]]),-EmBI_Indexes[[#This Row],[№]]))/B_Anwers*100+0.5),\"\"),\"\")","v":""},{"$f":"IFERROR(IF(ISNUMBER(EmBI_Indexes[[#This Row],[№]]),INT((COUNTIF(INDEX(I_1,,EmBI_Indexes[[#This Row],[№]]),-EmBI_Indexes[[#This Row],[№]])+COUNTIF(INDEX(I_2,,EmBI_Indexes[[#This Row],[№]]),-EmBI_Indexes[[#This Row],[№]])+COUNTIF(INDEX(I_3,,EmBI_Indexes[[#This Row],[№]]),-EmBI_Indexes[[#This Row],[№]]))/I_Anwers*100+0.5),\"\"),\"\")","v":""},{"$f":"IFERROR(IF(ISNUMBER(EmBI_Indexes[[#This Row],[№]]),INT((COUNTIF(INDEX(EmBI_1,,EmBI_Indexes[[#This Row],[№]]),-EmBI_Indexes[[#This Row],[№]])+COUNTIF(INDEX(EmBI_2,,EmBI_Indexes[[#This Row],[№]]),-EmBI_Indexes[[#This Row],[№]])+COUNTIF(INDEX(Em_3,,EmBI_Indexes[[#This Row],[№]]),-EmBI_Indexes[[#This Row],[№]]))/EmBI_Answers*100+0.5),\"\"),\"\")","v":""}]
[null,"Кол.работников",{"$f":"COUNTA('@'!$C$25:$C$44)","v":0},{"$f":"IFERROR(MATCH(ANSWER_NAME2,STAFF_LIST,0),0)","v":0},null,"Веса 1 и 2 п/п ответов",null,1.5,1.25,null,null,null,{"$f":"IF(ISNUMBER('@'!B28),IF(INDEX(TESTED,1,'@'!B28)=QUESTIONS_COUNT,'@'!B28,\"\"),\"\")","v":""},{"$f":"IF(ISNUMBER(EmBI_Indexes[[#This Row],[№]]),'@'!D28,\"\")","v":""},{"$f":"IFERROR(IF(ISNUMBER(EmBI_Indexes[[#This Row],[№]]),INT((COUNTIF(Em_1,EmBI_Indexes[[#This Row],[№]])*W_1+COUNTIF(Em_2,EmBI_Indexes[[#This Row],[№]])*W_2+COUNTIF(Em_3,EmBI_Indexes[[#This Row],[№]]))/Em_Wmax*100+0.5),\"\"),\"\")","v":""},{"$f":"IFERROR(IF(ISNUMBER(EmBI_Indexes[[#This Row],[№]]),INT((COUNTIF(B_1,EmBI_Indexes[[#This Row],[№]])*W_1+COUNTIF(B_2,EmBI_Indexes[[#This Row],[№]])*W_2+COUNTIF(B_3,EmBI_Indexes[[#This Row],[№]]))/B_Wmax*100+0.5),\"\"),\"\")","v":""},{"$f":"IFERROR(IF(ISNUMBER(EmBI_Indexes[[#This Row],[№]]),INT((COUNTIF(I_1,EmBI_Indexes[[#This Row],[№]])*W_1+COUNTIF(I_2,EmBI_Indexes[[#This Row],[№]])*W_2+COUNTIF(I_3,EmBI_Indexes[[#This Row],[№]]))/I_Wmax*100+0.5),\"\"),\"\")","v":""},{"$f":"IFERROR(IF(ISNUMBER(EmBI_Indexes[[#This Row],[№]]),INT((COUNTIF(EmBI_1,EmBI_Indexes[[#This Row],[№]])*W_1+COUNTIF(EmBI_2,EmBI_Indexes[[#This Row],[№]])*W_2+COUNTIF(EmBI_3,EmBI_Indexes[[#This Row],[№]]))/EmBI_Wmax*100+0.5),\"\"),\"\")","v":""},{"$f":"IFERROR(IF(ISNUMBER(EmBI_Indexes[[#This Row],[№]]),INT((COUNTIF(INDEX(Em_1,,EmBI_Indexes[[#This Row],[№]]),0)+COUNTIF(INDEX(Em_2,,EmBI_Indexes[[#This Row],[№]]),0)+COUNTIF(INDEX(Em_3,,EmBI_Indexes[[#This Row],[№]]),0))/Em_Anwers*100+0.5),\"\"),\"\")","v":""},{"$f":"IFERROR(IF(ISNUMBER(EmBI_Indexes[[#This Row],[№]]),INT((COUNTIF(INDEX(B_1,,EmBI_Indexes[[#This Row],[№]]),0)+COUNTIF(INDEX(B_2,,EmBI_Indexes[[#This Row],[№]]),0)+COUNTIF(INDEX(B_3,,EmBI_Indexes[[#This Row],[№]]),0))/B_Anwers*100+0.5),\"\"),\"\")","v":""},{"$f":"IFERROR(IF(ISNUMBER(EmBI_Indexes[[#This Row],[№]]),INT((COUNTIF(INDEX(I_1,,EmBI_Indexes[[#This Row],[№]]),0)+COUNTIF(INDEX(I_2,,EmBI_Indexes[[#This Row],[№]]),0)+COUNTIF(INDEX(I_3,,EmBI_Indexes[[#This Row],[№]]),0))/I_Anwers*100+0.5),\"\"),\"\")","v":""},{"$f":"IFERROR(IF(ISNUMBER(EmBI_Indexes[[#This Row],[№]]),INT((COUNTIF(INDEX(EmBI_1,,EmBI_Indexes[[#This Row],[№]]),0)+COUNTIF(INDEX(EmBI_2,,EmBI_Indexes[[#This Row],[№]]),0)+COUNTIF(INDEX(EmBI_3,,EmBI_Indexes[[#This Row],[№]]),0))/EmBI_Answers*100+0.5),\"\"),\"\")","v":""},{"$f":"IFERROR(IF(ISNUMBER(EmBI_Indexes[[#This Row],[№]]),INT((COUNTIF(INDEX(Em_1,,EmBI_Indexes[[#This Row],[№]]),-EmBI_Indexes[[#This Row],[№]])+COUNTIF(INDEX(Em_2,,EmBI_Indexes[[#This Row],[№]]),-EmBI_Indexes[[#This Row],[№]])+COUNTIF(INDEX(Em_3,,EmBI_Indexes[[#This Row],[№]]),-EmBI_Indexes[[#This Row],[№]]))/Em_Anwers*100+0.5),\"\"),\"\")","v":""},{"$f":"IFERROR(IF(ISNUMBER(EmBI_Indexes[[#This Row],[№]]),INT((COUNTIF(INDEX(B_1,,EmBI_Indexes[[#This Row],[№]]),-EmBI_Indexes[[#This Row],[№]])+COUNTIF(INDEX(B_2,,EmBI_Indexes[[#This Row],[№]]),-EmBI_Indexes[[#This Row],[№]])+COUNTIF(INDEX(B_3,,EmBI_Indexes[[#This Row],[№]]),-EmBI_Indexes[[#This Row],[№]]))/B_Anwers*100+0.5),\"\"),\"\")","v":""},{"$f":"IFERROR(IF(ISNUMBER(EmBI_Indexes[[#This Row],[№]]),INT((COUNTIF(INDEX(I_1,,EmBI_Indexes[[#This Row],[№]]),-EmBI_Indexes[[#This Row],[№]])+COUNTIF(INDEX(I_2,,EmBI_Indexes[[#This Row],[№]]),-EmBI_Indexes[[#This Row],[№]])+COUNTIF(INDEX(I_3,,EmBI_Indexes[[#This Row],[№]]),-EmBI_Indexes[[#This Row],[№]]))/I_Anwers*100+0.5),\"\"),\"\")","v":""},{"$f":"IFERROR(IF(ISNUMBER(EmBI_Indexes[[#This Row],[№]]),INT((COUNTIF(INDEX(EmBI_1,,EmBI_Indexes[[#This Row],[№]]),-EmBI_Indexes[[#This Row],[№]])+COUNTIF(INDEX(EmBI_2,,EmBI_Indexes[[#This Row],[№]]),-EmBI_Indexes[[#This Row],[№]])+COUNTIF(INDEX(Em_3,,EmBI_Indexes[[#This Row],[№]]),-EmBI_Indexes[[#This Row],[№]]))/EmBI_Answers*100+0.5),\"\"),\"\")","v":""}]
[null,"Кол.тестирований",{"$f":"COUNTIF(TESTED,QUESTIONS_COUNT)","v":0},{"$f":"IFERROR(MATCH(ANSWER_NAME3,STAFF_LIST,0),0)","v":0},null,"Макс оценка",null,{"$f":"H4*TESTED_COUNT*W_1","v":0},{"$f":"I4*TESTED_COUNT*W_1","v":0},{"$f":"J4*TESTED_COUNT*W_1","v":0},{"$f":"SUM(H7:J7)","v":0},null,{"$f":"IF(ISNUMBER('@'!B29),IF(INDEX(TESTED,1,'@'!B29)=QUESTIONS_COUNT,'@'!B29,\"\"),\"\")","v":""},{"$f":"IF(ISNUMBER(EmBI_Indexes[[#This Row],[№]]),'@'!D29,\"\")","v":""},{"$f":"IFERROR(IF(ISNUMBER(EmBI_Indexes[[#This Row],[№]]),INT((COUNTIF(Em_1,EmBI_Indexes[[#This Row],[№]])*W_1+COUNTIF(Em_2,EmBI_Indexes[[#This Row],[№]])*W_2+COUNTIF(Em_3,EmBI_Indexes[[#This Row],[№]]))/Em_Wmax*100+0.5),\"\"),\"\")","v":""},{"$f":"IFERROR(IF(ISNUMBER(EmBI_Indexes[[#This Row],[№]]),INT((COUNTIF(B_1,EmBI_Indexes[[#This Row],[№]])*W_1+COUNTIF(B_2,EmBI_Indexes[[#This Row],[№]])*W_2+COUNTIF(B_3,EmBI_Indexes[[#This Row],[№]]))/B_Wmax*100+0.5),\"\"),\"\")","v":""},{"$f":"IFERROR(IF(ISNUMBER(EmBI_Indexes[[#This Row],[№]]),INT((COUNTIF(I_1,EmBI_Indexes[[#This Row],[№]])*W_1+COUNTIF(I_2,EmBI_Indexes[[#This Row],[№]])*W_2+COUNTIF(I_3,EmBI_Indexes[[#This Row],[№]]))/I_Wmax*100+0.5),\"\"),\"\")","v":""},{"$f":"IFERROR(IF(ISNUMBER(EmBI_Indexes[[#This Row],[№]]),INT((COUNTIF(EmBI_1,EmBI_Indexes[[#This Row],[№]])*W_1+COUNTIF(EmBI_2,EmBI_Indexes[[#This Row],[№]])*W_2+COUNTIF(EmBI_3,EmBI_Indexes[[#This Row],[№]]))/EmBI_Wmax*100+0.5),\"\"),\"\")","v":""},{"$f":"IFERROR(IF(ISNUMBER(EmBI_Indexes[[#This Row],[№]]),INT((COUNTIF(INDEX(Em_1,,EmBI_Indexes[[#This Row],[№]]),0)+COUNTIF(INDEX(Em_2,,EmBI_Indexes[[#This Row],[№]]),0)+COUNTIF(INDEX(Em_3,,EmBI_Indexes[[#This Row],[№]]),0))/Em_Anwers*100+0.5),\"\"),\"\")","v":""},{"$f":"IFERROR(IF(ISNUMBER(EmBI_Indexes[[#This Row],[№]]),INT((COUNTIF(INDEX(B_1,,EmBI_Indexes[[#This Row],[№]]),0)+COUNTIF(INDEX(B_2,,EmBI_Indexes[[#This Row],[№]]),0)+COUNTIF(INDEX(B_3,,EmBI_Indexes[[#This Row],[№]]),0))/B_Anwers*100+0.5),\"\"),\"\")","v":""},{"$f":"IFERROR(IF(ISNUMBER(EmBI_Indexes[[#This Row],[№]]),INT((COUNTIF(INDEX(I_1,,EmBI_Indexes[[#This Row],[№]]),0)+COUNTIF(INDEX(I_2,,EmBI_Indexes[[#This Row],[№]]),0)+COUNTIF(INDEX(I_3,,EmBI_Indexes[[#This Row],[№]]),0))/I_Anwers*100+0.5),\"\"),\"\")","v":""},{"$f":"IFERROR(IF(ISNUMBER(EmBI_Indexes[[#This Row],[№]]),INT((COUNTIF(INDEX(EmBI_1,,EmBI_Indexes[[#This Row],[№]]),0)+COUNTIF(INDEX(EmBI_2,,EmBI_Indexes[[#This Row],[№]]),0)+COUNTIF(INDEX(EmBI_3,,EmBI_Indexes[[#This Row],[№]]),0))/EmBI_Answers*100+0.5),\"\"),\"\")","v":""},{"$f":"IFERROR(IF(ISNUMBER(EmBI_Indexes[[#This Row],[№]]),INT((COUNTIF(INDEX(Em_1,,EmBI_Indexes[[#This Row],[№]]),-EmBI_Indexes[[#This Row],[№]])+COUNTIF(INDEX(Em_2,,EmBI_Indexes[[#This Row],[№]]),-EmBI_Indexes[[#This Row],[№]])+COUNTIF(INDEX(Em_3,,EmBI_Indexes[[#This Row],[№]]),-EmBI_Indexes[[#This Row],[№]]))/Em_Anwers*100+0.5),\"\"),\"\")","v":""},{"$f":"IFERROR(IF(ISNUMBER(EmBI_Indexes[[#This Row],[№]]),INT((COUNTIF(INDEX(B_1,,EmBI_Indexes[[#This Row],[№]]),-EmBI_Indexes[[#This Row],[№]])+COUNTIF(INDEX(B_2,,EmBI_Indexes[[#This Row],[№]]),-EmBI_Indexes[[#This Row],[№]])+COUNTIF(INDEX(B_3,,EmBI_Indexes[[#This Row],[№]]),-EmBI_Indexes[[#This Row],[№]]))/B_Anwers*100+0.5),\"\"),\"\")","v":""},{"$f":"IFERROR(IF(ISNUMBER(EmBI_Indexes[[#This Row],[№]]),INT((COUNTIF(INDEX(I_1,,EmBI_Indexes[[#This Row],[№]]),-EmBI_Indexes[[#This Row],[№]])+COUNTIF(INDEX(I_2,,EmBI_Indexes[[#This Row],[№]]),-EmBI_Indexes[[#This Row],[№]])+COUNTIF(INDEX(I_3,,EmBI_Indexes[[#This Row],[№]]),-EmBI_Indexes[[#This Row],[№]]))/I_Anwers*100+0.5),\"\"),\"\")","v":""},{"$f":"IFERROR(IF(ISNUMBER(EmBI_Indexes[[#This Row],[№]]),INT((COUNTIF(INDEX(EmBI_1,,EmBI_Indexes[[#This Row],[№]]),-EmBI_Indexes[[#This Row],[№]])+COUNTIF(INDEX(EmBI_2,,EmBI_Indexes[[#This Row],[№]]),-EmBI_Indexes[[#This Row],[№]])+COUNTIF(INDEX(Em_3,,EmBI_Indexes[[#This Row],[№]]),-EmBI_Indexes[[#This Row],[№]]))/EmBI_Answers*100+0.5),\"\"),\"\")","v":""}]
[null,"Макс.кол.тестирований",{"$f":"COUNT(TESTED)","v":20},null,null,"Индексы EmBI",null,{"$f":"IFERROR(INT(AVERAGE(EmBI_Indexes[Em])+0.5),\"\")","v":""},{"$f":"IFERROR(INT(AVERAGE(EmBI_Indexes[B])+0.5),\"\")","v":""},{"$f":"IFERROR(INT(AVERAGE(EmBI_Indexes[I])+0.5),\"\")","v":""},{"$f":"IFERROR(INT(AVERAGE(EmBI_Indexes[EmBI])+0.5),\"\")","v":""},null,{"$f":"IF(ISNUMBER('@'!B30),IF(INDEX(TESTED,1,'@'!B30)=QUESTIONS_COUNT,'@'!B30,\"\"),\"\")","v":""},{"$f":"IF(ISNUMBER(EmBI_Indexes[[#This Row],[№]]),'@'!D30,\"\")","v":""},{"$f":"IFERROR(IF(ISNUMBER(EmBI_Indexes[[#This Row],[№]]),INT((COUNTIF(Em_1,EmBI_Indexes[[#This Row],[№]])*W_1+COUNTIF(Em_2,EmBI_Indexes[[#This Row],[№]])*W_2+COUNTIF(Em_3,EmBI_Indexes[[#This Row],[№]]))/Em_Wmax*100+0.5),\"\"),\"\")","v":""},{"$f":"IFERROR(IF(ISNUMBER(EmBI_Indexes[[#This Row],[№]]),INT((COUNTIF(B_1,EmBI_Indexes[[#This Row],[№]])*W_1+COUNTIF(B_2,EmBI_Indexes[[#This Row],[№]])*W_2+COUNTIF(B_3,EmBI_Indexes[[#This Row],[№]]))/B_Wmax*100+0.5),\"\"),\"\")","v":""},{"$f":"IFERROR(IF(ISNUMBER(EmBI_Indexes[[#This Row],[№]]),INT((COUNTIF(I_1,EmBI_Indexes[[#This Row],[№]])*W_1+COUNTIF(I_2,EmBI_Indexes[[#This Row],[№]])*W_2+COUNTIF(I_3,EmBI_Indexes[[#This Row],[№]]))/I_Wmax*100+0.5),\"\"),\"\")","v":""},{"$f":"IFERROR(IF(ISNUMBER(EmBI_Indexes[[#This Row],[№]]),INT((COUNTIF(EmBI_1,EmBI_Indexes[[#This Row],[№]])*W_1+COUNTIF(EmBI_2,EmBI_Indexes[[#This Row],[№]])*W_2+COUNTIF(EmBI_3,EmBI_Indexes[[#This Row],[№]]))/EmBI_Wmax*100+0.5),\"\"),\"\")","v":""},{"$f":"IFERROR(IF(ISNUMBER(EmBI_Indexes[[#This Row],[№]]),INT((COUNTIF(INDEX(Em_1,,EmBI_Indexes[[#This Row],[№]]),0)+COUNTIF(INDEX(Em_2,,EmBI_Indexes[[#This Row],[№]]),0)+COUNTIF(INDEX(Em_3,,EmBI_Indexes[[#This Row],[№]]),0))/Em_Anwers*100+0.5),\"\"),\"\")","v":""},{"$f":"IFERROR(IF(ISNUMBER(EmBI_Indexes[[#This Row],[№]]),INT((COUNTIF(INDEX(B_1,,EmBI_Indexes[[#This Row],[№]]),0)+COUNTIF(INDEX(B_2,,EmBI_Indexes[[#This Row],[№]]),0)+COUNTIF(INDEX(B_3,,EmBI_Indexes[[#This Row],[№]]),0))/B_Anwers*100+0.5),\"\"),\"\")","v":""},{"$f":"IFERROR(IF(ISNUMBER(EmBI_Indexes[[#This Row],[№]]),INT((COUNTIF(INDEX(I_1,,EmBI_Indexes[[#This Row],[№]]),0)+COUNTIF(INDEX(I_2,,EmBI_Indexes[[#This Row],[№]]),0)+COUNTIF(INDEX(I_3,,EmBI_Indexes[[#This Row],[№]]),0))/I_Anwers*100+0.5),\"\"),\"\")","v":""},{"$f":"IFERROR(IF(ISNUMBER(EmBI_Indexes[[#This Row],[№]]),INT((COUNTIF(INDEX(EmBI_1,,EmBI_Indexes[[#This Row],[№]]),0)+COUNTIF(INDEX(EmBI_2,,EmBI_Indexes[[#This Row],[№]]),0)+COUNTIF(INDEX(EmBI_3,,EmBI_Indexes[[#This Row],[№]]),0))/EmBI_Answers*100+0.5),\"\"),\"\")","v":""},{"$f":"IFERROR(IF(ISNUMBER(EmBI_Indexes[[#This Row],[№]]),INT((COUNTIF(INDEX(Em_1,,EmBI_Indexes[[#This Row],[№]]),-EmBI_Indexes[[#This Row],[№]])+COUNTIF(INDEX(Em_2,,EmBI_Indexes[[#This Row],[№]]),-EmBI_Indexes[[#This Row],[№]])+COUNTIF(INDEX(Em_3,,EmBI_Indexes[[#This Row],[№]]),-EmBI_Indexes[[#This Row],[№]]))/Em_Anwers*100+0.5),\"\"),\"\")","v":""},{"$f":"IFERROR(IF(ISNUMBER(EmBI_Indexes[[#This Row],[№]]),INT((COUNTIF(INDEX(B_1,,EmBI_Indexes[[#This Row],[№]]),-EmBI_Indexes[[#This Row],[№]])+COUNTIF(INDEX(B_2,,EmBI_Indexes[[#This Row],[№]]),-EmBI_Indexes[[#This Row],[№]])+COUNTIF(INDEX(B_3,,EmBI_Indexes[[#This Row],[№]]),-EmBI_Indexes[[#This Row],[№]]))/B_Anwers*100+0.5),\"\"),\"\")","v":""},{"$f":"IFERROR(IF(ISNUMBER(EmBI_Indexes[[#This Row],[№]]),INT((COUNTIF(INDEX(I_1,,EmBI_Indexes[[#This Row],[№]]),-EmBI_Indexes[[#This Row],[№]])+COUNTIF(INDEX(I_2,,EmBI_Indexes[[#This Row],[№]]),-EmBI_Indexes[[#This Row],[№]])+COUNTIF(INDEX(I_3,,EmBI_Indexes[[#This Row],[№]]),-EmBI_Indexes[[#This Row],[№]]))/I_Anwers*100+0.5),\"\"),\"\")","v":""},{"$f":"IFERROR(IF(ISNUMBER(EmBI_Indexes[[#This Row],[№]]),INT((COUNTIF(INDEX(EmBI_1,,EmBI_Indexes[[#This Row],[№]]),-EmBI_Indexes[[#This Row],[№]])+COUNTIF(INDEX(EmBI_2,,EmBI_Indexes[[#This Row],[№]]),-EmBI_Indexes[[#This Row],[№]])+COUNTIF(INDEX(Em_3,,EmBI_Indexes[[#This Row],[№]]),-EmBI_Indexes[[#This Row],[№]]))/EmBI_Answers*100+0.5),\"\"),\"\")","v":""}]
{"$rows_left_out":40}