{"text_format":"1","workbook":"xlsx","n_sheets":3,"sheets":["!","@","Options"],"not_rendered":{"charts":1,"images":1,"macros":1,"external_links":0,"defined_names":17,"comments":0,"pivot_tables":0},"unopened":[],"bounds":{"document_bytes":16777216,"sheet_cells":100000,"rows_first":2000,"rows_last":500,"rows_between":2000,"halvings":0,"cell_chars":16384,"cell_head_chars":4096},"cells_cut":0,"cells_raw":0,"read":"whole","date_system":"1900"}

{"sheet":"!","index":0,"n_rows":31,"n_cols":3,"rows_kept":31,"cut":false,"hidden":false,"merged":[[22,2,22,12],[24,2,24,12],[26,2,26,12],[28,2,28,12],[30,2,30,12]]}
[]
[]
[]
[]
[]
[]
[]
[]
[]
[]
[]
[]
[]
[]
[]
[]
[]
[]
[]
[]
[]
[]
[null,null,{"$f":"QUESTION_1","v":""}]
[]
[null,null,{"$f":"QUESTION_2","v":""}]
[]
[null,null,{"$f":"QUESTION_3","v":""}]
[]
[null,null,{"$f":"QUESTION_4","v":""}]
[]
[null,null,{"$f":"QUESTION_5","v":""}]

{"sheet":"@","index":1,"n_rows":185,"n_cols":19,"rows_kept":185,"cut":false,"hidden":false,"merged":[[184,2,184,17],[178,2,178,17],[179,2,179,17],[180,2,180,17],[181,2,181,17],[182,2,182,17],[183,2,183,17],[166,2,166,17],[167,2,167,17],[168,2,168,17],[169,2,169,17],[170,2,170,17],[171,2,171,17],[174,2,174,17],[175,2,175,17],[176,2,176,17],[177,2,177,17],[172,2,172,17],[173,2,173,17],[119,2,119,17],[120,2,120,17],[121,2,121,17],[122,2,122,17],[123,2,123,17],[154,2,154,17],[155,2,155,17],[156,2,156,17],[157,2,157,17],[142,2,142,17],[143,2,143,17],[144,2,144,17],[145,2,145,17],[146,2,146,17],[147,2,147,17],[148,2,148,17],[149,2,149,17],[139,2,139,17],[140,2,140,17],[141,2,141,17],[136,2,136,17],[137,2,137,17],[126,2,126,17],[127,2,127,17],[111,2,111,17],[94,2,94,17],[95,2,95,17],[96,2,96,17],[97,2,97,17],[98,2,98,17],[99,2,99,17],[100,2,100,17],[101,2,101,17],[106,2,106,17],[107,2,107,17],[108,2,108,17],[109,2,109,17],[110,2,110,17],[49,2,49,17],[50,2,50,17],[51,2,51,17],[52,2,52,17],[53,2,53,17],[82,2,82,17],[83,2,83,17],[84,2,84,17],[85,2,85,17],[70,2,70,17],[71,2,71,17],[72,2,72,17],[73,2,73,17],[74,2,74,17],[75,2,75,17],[76,2,76,17],[77,2,77,17],[54,2,54,17],[55,2,55,17],[56,2,56,17],[57,2,57,17],[58,2,58,17],[59,2,59,17],[60,2,60,17],[162,2,162,17],[163,2,163,17],[164,2,164,17],[165,2,165,17],[160,2,160,17],[161,2,161,17],[150,2,150,17],[151,2,151,17],[152,2,152,17],[153,2,153,17],[158,2,158,17],[159,2,159,17],[129,2,129,17],[124,2,124,17],[125,2,125,17],[130,2,130,17],[131,2,131,17],[132,2,132,17],[133,2,133,17],[134,2,134,17],[135,2,135,17],[90,2,90,17],[91,2,91,17],[92,2,92,17],[93,2,93,17],[88,2,88,17],[89,2,89,17],[78,2,78,17],[79,2,79,17],[80,2,80,17],[81,2,81,17],[61,2,61,17],[62,2,62,17],[63,2,63,17],[86,2,86,17],[87,2,87,17],[118,2,118,17],[128,2,128,17],[138,2,138,17],[66,2,66,17],[67,2,67,17],[68,2,68,17],[69,2,69,17],[64,2,64,17],[65,2,65,17],[114,2,114,17],[115,2,115,17],[116,2,116,17],[117,2,117,17],[112,2,112,17],[113,2,113,17],[102,2,102,17],[104,2,104,17],[105,2,105,17],[103,2,103,17]]}
[]
[]
[]
[]
[]
[]
[]
[]
[]
[]
[]
[]
[]
[]
[]
[]
[]
[]
[]
[]
[]
[]
[]
[]
[]
[null,null,"Стили","Оценка"]
[null,null,"«Внимание к производительности труда»",{"$f":"Options!E18","v":0}]
[null,null,"«Внимание к работе»",{"$f":"Options!E19","v":0}]
[null,null,"«Внимание к человеку»",{"$f":"Options!E20","v":0}]
[]
[]
[]
[]
[]
[]
[]
[]
[]
[]
[]
[]
[]
[]
[]
[]
[]
[]
[]
[]
[null,"№ п/п","Вопрос",null,null,null,null,null,null,null,null,null,null,null,null,null,null,null,"% ответов"]
[null,{"$f":"IF(VIEW_REZULTS,IF(Options!B25<>Options!B24,Options!B25,\"\"),\"\")","v":""},{"$f":"IF(VIEW_REZULTS,Options!C25,\"\")","v":""},null,null,null,null,null,null,null,null,null,null,null,null,null,null,null,{"$f":"IF(VIEW_REZULTS,Options!G25,\"\")","v":""}]
[null,{"$f":"IF(VIEW_REZULTS,IF(Options!B26<>Options!B25,Options!B26,\"\"),\"\")","v":""},{"$f":"IF(VIEW_REZULTS,Options!C26,\"\")","v":""},null,null,null,null,null,null,null,null,null,null,null,null,null,null,null,{"$f":"IF(VIEW_REZULTS,Options!G26,\"\")","v":""}]
[null,{"$f":"IF(VIEW_REZULTS,IF(Options!B27<>Options!B26,Options!B27,\"\"),\"\")","v":""},{"$f":"IF(VIEW_REZULTS,Options!C27,\"\")","v":""},null,null,null,null,null,null,null,null,null,null,null,null,null,null,null,{"$f":"IF(VIEW_REZULTS,Options!G27,\"\")","v":""}]
[null,{"$f":"IF(VIEW_REZULTS,IF(Options!B28<>Options!B27,Options!B28,\"\"),\"\")","v":""},{"$f":"IF(VIEW_REZULTS,Options!C28,\"\")","v":""},null,null,null,null,null,null,null,null,null,null,null,null,null,null,null,{"$f":"IF(VIEW_REZULTS,Options!G28,\"\")","v":""}]
[null,{"$f":"IF(VIEW_REZULTS,IF(Options!B29<>Options!B28,Options!B29,\"\"),\"\")","v":""},{"$f":"IF(VIEW_REZULTS,Options!C29,\"\")","v":""},null,null,null,null,null,null,null,null,null,null,null,null,null,null,null,{"$f":"IF(VIEW_REZULTS,Options!G29,\"\")","v":""}]
[null,{"$f":"IF(VIEW_REZULTS,IF(Options!B30<>Options!B29,Options!B30,\"\"),\"\")","v":""},{"$f":"IF(VIEW_REZULTS,Options!C30,\"\")","v":""},null,null,null,null,null,null,null,null,null,null,null,null,null,null,null,{"$f":"IF(VIEW_REZULTS,Options!G30,\"\")","v":""}]
[null,{"$f":"IF(VIEW_REZULTS,IF(Options!B31<>Options!B30,Options!B31,\"\"),\"\")","v":""},{"$f":"IF(VIEW_REZULTS,Options!C31,\"\")","v":""},null,null,null,null,null,null,null,null,null,null,null,null,null,null,null,{"$f":"IF(VIEW_REZULTS,Options!G31,\"\")","v":""}]
[null,{"$f":"IF(VIEW_REZULTS,IF(Options!B32<>Options!B31,Options!B32,\"\"),\"\")","v":""},{"$f":"IF(VIEW_REZULTS,Options!C32,\"\")","v":""},null,null,null,null,null,null,null,null,null,null,null,null,null,null,null,{"$f":"IF(VIEW_REZULTS,Options!G32,\"\")","v":""}]
[null,{"$f":"IF(VIEW_REZULTS,IF(Options!B33<>Options!B32,Options!B33,\"\"),\"\")","v":""},{"$f":"IF(VIEW_REZULTS,Options!C33,\"\")","v":""},null,null,null,null,null,null,null,null,null,null,null,null,null,null,null,{"$f":"IF(VIEW_REZULTS,Options!G33,\"\")","v":""}]
[null,{"$f":"IF(VIEW_REZULTS,IF(Options!B34<>Options!B33,Options!B34,\"\"),\"\")","v":""},{"$f":"IF(VIEW_REZULTS,Options!C34,\"\")","v":""},null,null,null,null,null,null,null,null,null,null,null,null,null,null,null,{"$f":"IF(VIEW_REZULTS,Options!G34,\"\")","v":""}]
{"$rows_left_out":126}
{"sheet":"Options","index":2,"n_rows":159,"n_cols":28,"rows_kept":159,"cut":false,"hidden":true,"merged":[[1,2,1,3]]}
[]
[null,null,"Параметры"]
[null,null,"Всего вопросов",27]
[null,null,"Номер вопроса",0]
[null,null,"Вопрос-ответ 1",{"$f":"IF(QUESTION_NUM>0,INDEX(dbTest[Вопрос],(QUESTION_NUM-1)*5+1,1),\"\")","v":""}]
[null,null,"Вопрос-ответ 2",{"$f":"IF(QUESTION_NUM>0,INDEX(dbTest[Вопрос],(QUESTION_NUM-1)*5+2,1),\"\")","v":""}]
[null,null,"Вопрос-ответ 3",{"$f":"IF(QUESTION_NUM>0,INDEX(dbTest[Вопрос],(QUESTION_NUM-1)*5+3,1),\"\")","v":""}]
[null,null,"Вопрос-ответ 4",{"$f":"IF(QUESTION_NUM>0,INDEX(dbTest[Вопрос],(QUESTION_NUM-1)*5+4,1),\"\")","v":""}]
[null,null,"Вопрос-ответ 5",{"$f":"IF(QUESTION_NUM>0,INDEX(dbTest[Вопрос],(QUESTION_NUM-1)*5+5,1),\"\")","v":""}]
[null,null,"Количество вариантов вопросов",{"$f":"COUNTA(dbTest[№])","v":135}]
[null,null,"Макс. количество тестирований",{"$f":"COUNT(TESTED)","v":20}]
[null,null,"Количество протестированных",{"$f":"SUM(TESTED)","v":0}]
[null,null,"Тестируемый №",{"$f":"IFERROR(MATCH(0,TESTED,0),0)","v":1}]
[null,null,"Удаление теста",0,{"$f":"IF(DELETE_NUM>0,IF(DELETE_NUM=21,\"Все\",DELETE_NUM),\"-\")","v":"-"}]
[null,null,"Просмотр теста",{"$f":"TESTED_COUNT>1","v":false}]
[]
[null,null,"Стили","Баллы","Оценка"]
[null,null,"«Внимание к производительности труда»",{"$f":"IF(VIEW_REZULTS,SUMPRODUCT(dbTest[E],dbTest[Итог]),\"\")","v":""},{"$f":"IF($D$21>0,INT(D18/$D$21*100+0.5),0)","v":0}]
[null,null,"«Внимание к работе»",{"$f":"IF(VIEW_REZULTS,SUMPRODUCT(dbTest[W],dbTest[Итог]),\"\")","v":""},{"$f":"IF($D$21>0,INT(D19/$D$21*100+0.5),0)","v":0}]
[null,null,"«Внимание к человеку»",{"$f":"IF(VIEW_REZULTS,SUMPRODUCT(dbTest[H],dbTest[Итог]),\"\")","v":""},{"$f":"IF($D$21>0,100-E18-E19,0)","v":0}]
[null,null,"Итог",{"$f":"SUM(D18:D20)","v":0}]
[]
[null,null,null,null,null,null,null,null,{"$f":"IF(COUNT(dbTest[1])=QUESTIONS_MAX,1,0)","v":0},{"$f":"IF(COUNT(dbTest[2])=QUESTIONS_MAX,1,0)","v":0},{"$f":"IF(COUNT(dbTest[3])=QUESTIONS_MAX,1,0)","v":0},{"$f":"IF(COUNT(dbTest[4])=QUESTIONS_MAX,1,0)","v":0},{"$f":"IF(COUNT(dbTest[5])=QUESTIONS_MAX,1,0)","v":0},{"$f":"IF(COUNT(dbTest[6])=QUESTIONS_MAX,1,0)","v":0},{"$f":"IF(COUNT(dbTest[7])=QUESTIONS_MAX,1,0)","v":0},{"$f":"IF(COUNT(dbTest[8])=QUESTIONS_MAX,1,0)","v":0},{"$f":"IF(COUNT(dbTest[9])=QUESTIONS_MAX,1,0)","v":0},{"$f":"IF(COUNT(dbTest[10])=QUESTIONS_MAX,1,0)","v":0},{"$f":"IF(COUNT(dbTest[11])=QUESTIONS_MAX,1,0)","v":0},{"$f":"IF(COUNT(dbTest[12])=QUESTIONS_MAX,1,0)","v":0},{"$f":"IF(COUNT(dbTest[13])=QUESTIONS_MAX,1,0)","v":0},{"$f":"IF(COUNT(dbTest[14])=QUESTIONS_MAX,1,0)","v":0},{"$f":"IF(COUNT(dbTest[15])=QUESTIONS_MAX,1,0)","v":0},{"$f":"IF(COUNT(dbTest[16])=QUESTIONS_MAX,1,0)","v":0},{"$f":"IF(COUNT(dbTest[17])=QUESTIONS_MAX,1,0)","v":0},{"$f":"IF(COUNT(dbTest[18])=QUESTIONS_MAX,1,0)","v":0},{"$f":"IF(COUNT(dbTest[19])=QUESTIONS_MAX,1,0)","v":0},{"$f":"IF(COUNT(dbTest[20])=QUESTIONS_MAX,1,0)","v":0}]
[null,"№","Вопрос","W","H","E","Итог%","Итог","1","2","3","4","5","6","7","8","9","10","11","12","13","14","15","16","17","18","19","20"]
[null,1,"Руководитель централизует управление группой, замыкая на себе решение всех задач.",3,0,0,{"$f":"IF(TESTED_COUNT>0,INT(dbTest[[#This Row],[Итог]]/TESTED_COUNT*100+0.5),0)","v":0},{"$f":"SUM(dbTest[[#This Row],[1]:[20]])","v":0}]
[null,1,"Руководитель пассивен в выполнении управленческих функций.",0,3,0,{"$f":"IF(TESTED_COUNT>0,INT(dbTest[[#This Row],[Итог]]/TESTED_COUNT*100+0.5),0)","v":0},{"$f":"SUM(dbTest[[#This Row],[1]:[20]])","v":0}]
[null,1,"Руководитель чётко распределяет функции между собой и своими подчиненными.",1,0,3,{"$f":"IF(TESTED_COUNT>0,INT(dbTest[[#This Row],[Итог]]/TESTED_COUNT*100+0.5),0)","v":0},{"$f":"SUM(dbTest[[#This Row],[1]:[20]])","v":0}]
[null,1,"Руководитель ожидает указаний сверху или даже требует их.",1,3,0,{"$f":"IF(TESTED_COUNT>0,INT(dbTest[[#This Row],[Итог]]/TESTED_COUNT*100+0.5),0)","v":0},{"$f":"SUM(dbTest[[#This Row],[1]:[20]])","v":0}]
[null,1,"Руководитель централизует руководство только в трудных ситуациях.",0,0,3,{"$f":"IF(TESTED_COUNT>0,INT(dbTest[[#This Row],[Итог]]/TESTED_COUNT*100+0.5),0)","v":0},{"$f":"SUM(dbTest[[#This Row],[1]:[20]])","v":0}]
[null,2,"Руководитель в критических ситуациях, как правило, переходит на более жесткие методы управления.",3,0,1,{"$f":"IF(TESTED_COUNT>0,INT(dbTest[[#This Row],[Итог]]/TESTED_COUNT*100+0.5),0)","v":0},{"$f":"SUM(dbTest[[#This Row],[1]:[20]])","v":0}]
[null,2,"Руководитель в критических ситуациях не меняет своих способов руководства.",1,0,3,{"$f":"IF(TESTED_COUNT>0,INT(dbTest[[#This Row],[Итог]]/TESTED_COUNT*100+0.5),0)","v":0},{"$f":"SUM(dbTest[[#This Row],[1]:[20]])","v":0}]
[null,2,"Руководитель в критических ситуациях не обходится без помощи вышестоящих руководителей.",1,3,1,{"$f":"IF(TESTED_COUNT>0,INT(dbTest[[#This Row],[Итог]]/TESTED_COUNT*100+0.5),0)","v":0},{"$f":"SUM(dbTest[[#This Row],[1]:[20]])","v":0}]
[null,2,"Руководитель сталкиваясь с трудностями, начинает более тесно взаимодействовать с подчинёнными.",1,2,1,{"$f":"IF(TESTED_COUNT>0,INT(dbTest[[#This Row],[Итог]]/TESTED_COUNT*100+0.5),0)","v":0},{"$f":"SUM(dbTest[[#This Row],[1]:[20]])","v":0}]
[null,2,"Руководитель в критических ситуациях плохо справляется со своими обязанностями.",1,3,0,{"$f":"IF(TESTED_COUNT>0,INT(dbTest[[#This Row],[Итог]]/TESTED_COUNT*100+0.5),0)","v":0},{"$f":"SUM(dbTest[[#This Row],[1]:[20]])","v":0}]
[null,3,"Руководитель недостаточно общительный человек, с людьми разговаривает мало.",3,0,0,{"$f":"IF(TESTED_COUNT>0,INT(dbTest[[#This Row],[Итог]]/TESTED_COUNT*100+0.5),0)","v":0},{"$f":"SUM(dbTest[[#This Row],[1]:[20]])","v":0}]
[null,3,"Руководитель регулярно общается с подчинёнными, говорит о положении дел в коллективе, о трудностях, которые предстоит преодолеть.",0,1,3,{"$f":"IF(TESTED_COUNT>0,INT(dbTest[[#This Row],[Итог]]/TESTED_COUNT*100+0.5),0)","v":0},{"$f":"SUM(dbTest[[#This Row],[1]:[20]])","v":0}]
[null,3,"Руководитель умеет общаться, но специально ограничивает общение с подчинёнными, держится от них на расстоянии.",3,1,0,{"$f":"IF(TESTED_COUNT>0,INT(dbTest[[#This Row],[Итог]]/TESTED_COUNT*100+0.5),0)","v":0},{"$f":"SUM(dbTest[[#This Row],[1]:[20]])","v":0}]
[null,3,"Руководитель старается общаться с подчинёнными, но при этом испытывает трудности в общении.",0,2,1,{"$f":"IF(TESTED_COUNT>0,INT(dbTest[[#This Row],[Итог]]/TESTED_COUNT*100+0.5),0)","v":0},{"$f":"SUM(dbTest[[#This Row],[1]:[20]])","v":0}]
[null,3,"Руководитель общается в основном с активом рабочей группы.",2,1,0,{"$f":"IF(TESTED_COUNT>0,INT(dbTest[[#This Row],[Итог]]/TESTED_COUNT*100+0.5),0)","v":0},{"$f":"SUM(dbTest[[#This Row],[1]:[20]])","v":0}]
[null,4,"В отсутствие руководителя подчинённые работают хуже.",3,0,1,{"$f":"IF(TESTED_COUNT>0,INT(dbTest[[#This Row],[Итог]]/TESTED_COUNT*100+0.5),0)","v":0},{"$f":"SUM(dbTest[[#This Row],[1]:[20]])","v":0}]
[null,4,"Рабочая группа не снижает продуктивности, если руководитель временно покидает её.",1,0,3,{"$f":"IF(TESTED_COUNT>0,INT(dbTest[[#This Row],[Итог]]/TESTED_COUNT*100+0.5),0)","v":0},{"$f":"SUM(dbTest[[#This Row],[1]:[20]])","v":0}]
[null,4,"Подчинённые постоянно работают не в полную силу, при другом руководителе могли бы сделать больше.",2,3,0,{"$f":"IF(TESTED_COUNT>0,INT(dbTest[[#This Row],[Итог]]/TESTED_COUNT*100+0.5),0)","v":0},{"$f":"SUM(dbTest[[#This Row],[1]:[20]])","v":0}]
[null,4,"Продуктивность работы повышается в отсутствие руководителя.",3,2,0,{"$f":"IF(TESTED_COUNT>0,INT(dbTest[[#This Row],[Итог]]/TESTED_COUNT*100+0.5),0)","v":0},{"$f":"SUM(dbTest[[#This Row],[1]:[20]])","v":0}]
[null,4,"В отсутствие руководителя рабочая группа работает с переменным успехом.",1,2,1,{"$f":"IF(TESTED_COUNT>0,INT(dbTest[[#This Row],[Итог]]/TESTED_COUNT*100+0.5),0)","v":0},{"$f":"SUM(dbTest[[#This Row],[1]:[20]])","v":0}]
[null,5,"Руководитель сам обращается за советом к подчинённым.",0,1,3,{"$f":"IF(TESTED_COUNT>0,INT(dbTest[[#This Row],[Итог]]/TESTED_COUNT*100+0.5),0)","v":0},{"$f":"SUM(dbTest[[#This Row],[1]:[20]])","v":0}]
[null,5,"Руководитель не допускает, чтобы подчинённые советовали и тем более возражали ему.",3,0,0,{"$f":"IF(TESTED_COUNT>0,INT(dbTest[[#This Row],[Итог]]/TESTED_COUNT*100+0.5),0)","v":0},{"$f":"SUM(dbTest[[#This Row],[1]:[20]])","v":0}]
[null,5,"Подчинённые не только советуют, но могут давать указания своему руководителю.",0,3,0,{"$f":"IF(TESTED_COUNT>0,INT(dbTest[[#This Row],[Итог]]/TESTED_COUNT*100+0.5),0)","v":0},{"$f":"SUM(dbTest[[#This Row],[1]:[20]])","v":0}]
[null,5,"Руководитель советуется даже тогда, когда обстоятельства не особенно требуют этого.",0,3,0,{"$f":"IF(TESTED_COUNT>0,INT(dbTest[[#This Row],[Итог]]/TESTED_COUNT*100+0.5),0)","v":0},{"$f":"SUM(dbTest[[#This Row],[1]:[20]])","v":0}]
[null,5,"Если подчинённые знают, как лучше выполнить работу, они говорят об этом руководителю.",0,0,3,{"$f":"IF(TESTED_COUNT>0,INT(dbTest[[#This Row],[Итог]]/TESTED_COUNT*100+0.5),0)","v":0},{"$f":"SUM(dbTest[[#This Row],[1]:[20]])","v":0}]
[null,6,"Руководитель контролирует работу своих подчинённых от случая к случаю.",0,3,0,{"$f":"IF(TESTED_COUNT>0,INT(dbTest[[#This Row],[Итог]]/TESTED_COUNT*100+0.5),0)","v":0},{"$f":"SUM(dbTest[[#This Row],[1]:[20]])","v":0}]
[null,6,"Руководитель всегда очень строго контролирует работу своих подчинённых и рабочей группы в целом.",3,0,3,{"$f":"IF(TESTED_COUNT>0,INT(dbTest[[#This Row],[Итог]]/TESTED_COUNT*100+0.5),0)","v":0},{"$f":"SUM(dbTest[[#This Row],[1]:[20]])","v":0}]
[null,6,"Контролируя работу, руководитель всегда оценивает её, замечает положительные результаты, хвалит подчинённых.",0,0,3,{"$f":"IF(TESTED_COUNT>0,INT(dbTest[[#This Row],[Итог]]/TESTED_COUNT*100+0.5),0)","v":0},{"$f":"SUM(dbTest[[#This Row],[1]:[20]])","v":0}]
[null,6,"Контролируя, руководитель обязательно выискивает недостатки в работе.",3,0,0,{"$f":"IF(TESTED_COUNT>0,INT(dbTest[[#This Row],[Итог]]/TESTED_COUNT*100+0.5),0)","v":0},{"$f":"SUM(dbTest[[#This Row],[1]:[20]])","v":0}]
[null,6,"Руководитель нередко вмешивается в работу своих подчинённых.",2,0,0,{"$f":"IF(TESTED_COUNT>0,INT(dbTest[[#This Row],[Итог]]/TESTED_COUNT*100+0.5),0)","v":0},{"$f":"SUM(dbTest[[#This Row],[1]:[20]])","v":0}]
[null,7,"Руководителя интересует только выполнение плана, а не отношение людей друг к другу.",3,1,0,{"$f":"IF(TESTED_COUNT>0,INT(dbTest[[#This Row],[Итог]]/TESTED_COUNT*100+0.5),0)","v":0},{"$f":"SUM(dbTest[[#This Row],[1]:[20]])","v":0}]
[null,7,"Решая поставленные задачи, руководитель старается создать хорошие отношения между людьми в коллективе.",0,2,3,{"$f":"IF(TESTED_COUNT>0,INT(dbTest[[#This Row],[Итог]]/TESTED_COUNT*100+0.5),0)","v":0},{"$f":"SUM(dbTest[[#This Row],[1]:[20]])","v":0}]
[null,7,"В целом, руководитель в работе не заинтересован, подходит к делу формально.",0,3,0,{"$f":"IF(TESTED_COUNT>0,INT(dbTest[[#This Row],[Итог]]/TESTED_COUNT*100+0.5),0)","v":0},{"$f":"SUM(dbTest[[#This Row],[1]:[20]])","v":0}]
[null,7,"Руководитель больше внимания уделяет налаживанию отношений в коллективе, а не выполнению рабочих заданий.",0,3,0,{"$f":"IF(TESTED_COUNT>0,INT(dbTest[[#This Row],[Итог]]/TESTED_COUNT*100+0.5),0)","v":0},{"$f":"SUM(dbTest[[#This Row],[1]:[20]])","v":0}]
[null,7,"Когда необходимо, руководитель защищает интересы своих подчиненных.",0,0,3,{"$f":"IF(TESTED_COUNT>0,INT(dbTest[[#This Row],[Итог]]/TESTED_COUNT*100+0.5),0)","v":0},{"$f":"SUM(dbTest[[#This Row],[1]:[20]])","v":0}]
[null,8,"Руководитель умеет приказывать так, что хочется выполнять порученное дело.",0,0,3,{"$f":"IF(TESTED_COUNT>0,INT(dbTest[[#This Row],[Итог]]/TESTED_COUNT*100+0.5),0)","v":0},{"$f":"SUM(dbTest[[#This Row],[1]:[20]])","v":0}]
{"$rows_left_out":99}